Reaction Details
TargetDisintegrin and metalloproteinase domain-containing protein 17
LigandBDBM50224961
Substrate/Competitorn/a
Meas. Tech.ChEMBL_461352 (CHEMBL927357)
IC50 5±n/a nM
Citation Chun, KPark, SKKim, HMChoi, YKim, MHPark, CHJoe, BYChun, TGChoi, HMLee, HYHong, SHKim, MSNam, KYHan, G Chromen-based TNF-alpha converting enzyme (TACE) inhibitors: design, synthesis, and biological evaluation. Bioorg Med Chem16:530-5 (2008) 
 
Disintegrin and metalloproteinase domain-containing protein 17
Name:Disintegrin and metalloproteinase domain-containing protein 17
Type:Enzyme
Mol. Mass.:93007.89
Organism:Homo sapiens (Human)
Description:
Residue:824
BDBM50224961
NameBDBM50224961
Synonyms:2-benzyl-N-hydroxy-3-(6-methyl-2-oxo-2H-chromen-3-yl)-propionamide | CHEMBL402030
TypeSmall organic molecule
Emp. Form.C20H19NO4
Mol. Mass.337.3692
SMILESCc1ccc2oc(=O)c(CC(Cc3ccccc3)C(=O)NO)cc2c1