Reaction Details
TargetSerine/threonine-protein kinase Chk2
LigandBDBM50224988
Substrate/Competitorn/a
Meas. Tech.ChEMBL_458529 (CHEMBL942788)
IC50 39±n/a nM
Citation Neff, DKLee-Dutra, ABlevitt, JMAxe, FUHack, MDBuma, JCRynberg, RBrunmark, AKarlsson, LBreitenbucher, JG 2-Aryl benzimidazoles featuring alkyl-linked pendant alcohols and amines as inhibitors of checkpoint kinase Chk2. Bioorg Med Chem Lett17:6467-71 (2007) 
 
Serine/threonine-protein kinase Chk2
Name:Serine/threonine-protein kinase Chk2
Type:Protein
Mol. Mass.:60908.59
Organism:Homo sapiens (Human)
Description:O96017
Residue:543
BDBM50224988
NameBDBM50224988
Synonyms:2-(4-((1-benzoylpiperidin-4-yl)methoxy)phenyl)-1H-benzo[d]imidazole-5-carboxamide | CHEMBL250158
TypeSmall organic molecule
Emp. Form.C27H26N4O3
Mol. Mass.454.5203
SMILESNC(=O)c1ccc2nc([nH]c2c1)-c1ccc(OCC2CCN(CC2)C(=O)c2ccccc2)cc1