Reaction Details
TargetSerine/threonine-protein kinase Chk2
LigandBDBM50224997
Substrate/Competitorn/a
Meas. Tech.ChEMBL_458529 (CHEMBL942788)
IC50 53±n/a nM
Citation Neff, DKLee-Dutra, ABlevitt, JMAxe, FUHack, MDBuma, JCRynberg, RBrunmark, AKarlsson, LBreitenbucher, JG 2-Aryl benzimidazoles featuring alkyl-linked pendant alcohols and amines as inhibitors of checkpoint kinase Chk2. Bioorg Med Chem Lett17:6467-71 (2007) 
 
Serine/threonine-protein kinase Chk2
Name:Serine/threonine-protein kinase Chk2
Type:Protein
Mol. Mass.:60908.59
Organism:Homo sapiens (Human)
Description:O96017
Residue:543
BDBM50224997
NameBDBM50224997
Synonyms:2-(4-(2-(1-(4-chlorobenzyl)piperidin-2-yl)ethoxy)phenyl)-1H-benzo[d]imidazole-5-carboxamide | CHEMBL398529
TypeSmall organic molecule
Emp. Form.C28H29ClN4O2
Mol. Mass.489.008
SMILESNC(=O)c1ccc2nc([nH]c2c1)-c1ccc(OCCC2CCCCN2Cc2ccc(Cl)cc2)cc1