Reaction Details
TargetDipeptidyl peptidase 4
LigandBDBM50225051
Substrate/Competitorn/a
Meas. Tech.ChEMBL_450927 (CHEMBL900014)
Ki 607±n/a nM
Citation Simpkins, LMBolton, SPi, ZSutton, JCKwon, CZhao, GMagnin, DRAugeri, DJGungor, TRotella, DPSun, ZLiu, YSlusarchyk, WSMarcinkeviciene, JRobertson, JGWang, ARobl, JAAtwal, KSZahler, RLParker, RAKirby, MSHamann, LG Potent non-nitrile dipeptidic dipeptidyl peptidase IV inhibitors. Bioorg Med Chem Lett17:6476-80 (2007) 
 
Dipeptidyl peptidase 4
Name:Dipeptidyl peptidase 4
Type:Enzyme
Mol. Mass.:88271.01
Organism:Homo sapiens (Human)
Description:P27487
Residue:766
BDBM50225051
NameBDBM50225051
Synonyms:(S)-2-amino-2-(3-hydroxy-5,7-dimethyl-adamantan-1-yl)-1-piperidin-1-yl-ethanone | CHEMBL236481
TypeSmall organic molecule
Emp. Form.C19H32N2O2
Mol. Mass.320.4696
SMILESCC12CC3(C)CC(O)(C1)CC(C2)(C3)[C@H](N)C(=O)N1CCCCC1