Reaction Details
TargetDipeptidyl peptidase 4
LigandBDBM50225055
Substrate/Competitorn/a
Meas. Tech.ChEMBL_450927 (CHEMBL900014)
Ki 152±n/a nM
Citation Simpkins, LMBolton, SPi, ZSutton, JCKwon, CZhao, GMagnin, DRAugeri, DJGungor, TRotella, DPSun, ZLiu, YSlusarchyk, WSMarcinkeviciene, JRobertson, JGWang, ARobl, JAAtwal, KSZahler, RLParker, RAKirby, MSHamann, LG Potent non-nitrile dipeptidic dipeptidyl peptidase IV inhibitors. Bioorg Med Chem Lett17:6476-80 (2007) 
 
Dipeptidyl peptidase 4
Name:Dipeptidyl peptidase 4
Type:Enzyme
Mol. Mass.:88271.01
Organism:Homo sapiens (Human)
Description:P27487
Residue:766
BDBM50225055
NameBDBM50225055
Synonyms:(S)-1-((1S,5R)-2-aza-bicyclo[3.1.0]hexan-2-yl)-2-amino-2-(3,3,5,5-tetramethylcyclohexyl)ethanone | CHEMBL238232
TypeSmall organic molecule
Emp. Form.C17H30N2O
Mol. Mass.278.4329
SMILESCC1(C)CC(CC(C)(C)C1)[C@H](N)C(=O)N1CC[C@@H]2C[C@H]12