Reaction Details
TargetVasopressin V1a receptor
LigandBDBM50225167
Substrate/Competitorn/a
Meas. Tech.ChEMBL_458590 (CHEMBL942873)
IC50 9±n/a nM
Citation Xiang, MARybczynski, PJPatel, MChen, RHMcComsey, DFZhang, HCGunnet, JWLook, RWang, YMinor, LKZhong, HMVillani, FJDemarest, KTDamiano, BPMaryanoff, BE Next-generation spirobenzazepines: identification of RWJ-676070 as a balanced vasopressin V1a/V2 receptor antagonist for human clinical studies. Bioorg Med Chem Lett17:6623-8 (2007) 
 
Vasopressin V1a receptor
Name:Vasopressin V1a receptor
Type:Receptor
Mol. Mass.:46820.18
Organism:Homo sapiens (Human)
Description:P37288
Residue:418
BDBM50225167
NameBDBM50225167
Synonyms:CHEMBL250346 | N-(4-{[3'-(hydroxymethyl)-1,2,3,5-tetrahydrospiro[1-benzazepine-4,1'-cyclopentan]-2'-en-1-yl]carbonyl}phenyl)-2-phenylbenzamide
TypeSmall organic molecule
Emp. Form.C35H32N2O3
Mol. Mass.528.6402
SMILESOCC1=CC2(CC1)CCN(C(=O)c1ccc(NC(=O)c3ccccc3-c3ccccc3)cc1)c1ccccc1C2