Reaction Details
TargetVasopressin V1a receptor
LigandBDBM50225166
Substrate/Competitorn/a
Meas. Tech.ChEMBL_458590 (CHEMBL942873)
IC50 8±n/a nM
Citation Xiang, MARybczynski, PJPatel, MChen, RHMcComsey, DFZhang, HCGunnet, JWLook, RWang, YMinor, LKZhong, HMVillani, FJDemarest, KTDamiano, BPMaryanoff, BE Next-generation spirobenzazepines: identification of RWJ-676070 as a balanced vasopressin V1a/V2 receptor antagonist for human clinical studies. Bioorg Med Chem Lett17:6623-8 (2007) 
 
Vasopressin V1a receptor
Name:Vasopressin V1a receptor
Type:Receptor
Mol. Mass.:46820.18
Organism:Homo sapiens (Human)
Description:P37288
Residue:418
BDBM50225166
NameBDBM50225166
Synonyms:(4R)-1-({4-[(2-chloro-5-fluorobenzene)amido]-3-ethoxyphenyl}carbonyl)-1,2,3,5-tetrahydrospiro[1-benzazepine-4,1'-cyclopentan]-2'-ene-3'-carboxylic acid | CHEMBL438523
TypeSmall organic molecule
Emp. Form.C31H28ClFN2O5
Mol. Mass.563.016
SMILESCCOc1cc(ccc1NC(=O)c1cc(F)ccc1Cl)C(=O)N1CC[C@@]2(CCC(=C2)C(O)=O)Cc2ccccc12