Reaction Details
TargetBeta-lactamase TEM
LigandBDBM50225373
Substrate/Competitorn/a
Meas. Tech.ChEMBL_451362 (CHEMBL901565)
Ki 10±n/a nM
Citation Venturelli, ATondi, DCancian, LMorandi, FCannazza, GSegatore, BPrati, FAmicosante, GShoichet, BKCosti, MP Optimizing cell permeation of an antibiotic resistance inhibitor for improved efficacy. J Med Chem50:5644-54 (2007) 
 
Beta-lactamase TEM
Name:Beta-lactamase TEM
Type:Enzyme
Mol. Mass.:31512.33
Organism:Escherichia coli
Description:P62593
Residue:286
BDBM50225373
NameBDBM50225373
Synonyms:CHEMBL396872 | pinacol 5-[(3,4-dichlorophenylamino)methyl]benzo[b]thiophen-2-ylboronate
TypeSmall organic molecule
Emp. Form.C15H12BCl2NO2S
Mol. Mass.352.043
SMILESOB(O)c1cc2cc(CNc3ccc(Cl)c(Cl)c3)ccc2s1