Reaction Details
TargetBeta-lactamase TEM
LigandBDBM50225376
Substrate/Competitorn/a
Meas. Tech.ChEMBL_451362 (CHEMBL901565)
Ki 30±n/a nM
Citation Venturelli, ATondi, DCancian, LMorandi, FCannazza, GSegatore, BPrati, FAmicosante, GShoichet, BKCosti, MP Optimizing cell permeation of an antibiotic resistance inhibitor for improved efficacy. J Med Chem50:5644-54 (2007) 
 
Beta-lactamase TEM
Name:Beta-lactamase TEM
Type:Enzyme
Mol. Mass.:31512.33
Organism:Escherichia coli
Description:P62593
Residue:286
BDBM50225376
NameBDBM50225376
Synonyms:CHEMBL397522 | pinacol 5-bromomethylbenzo[b]thiophen-2-ylboronate
TypeSmall organic molecule
Emp. Form.C8H6BBrO2S
Mol. Mass.256.912
SMILESOB(O)c1cc2cc(Br)ccc2s1