Reaction Details
TargetBeta-lactamase TEM
LigandBDBM50225378
Substrate/Competitorn/a
Meas. Tech.ChEMBL_451362 (CHEMBL901565)
Ki 37±n/a nM
Citation Venturelli, ATondi, DCancian, LMorandi, FCannazza, GSegatore, BPrati, FAmicosante, GShoichet, BKCosti, MP Optimizing cell permeation of an antibiotic resistance inhibitor for improved efficacy. J Med Chem50:5644-54 (2007) 
 
Beta-lactamase TEM
Name:Beta-lactamase TEM
Type:Enzyme
Mol. Mass.:31512.33
Organism:Escherichia coli
Description:P62593
Residue:286
BDBM50225378
NameBDBM50225378
Synonyms:CHEMBL235073 {5-[(DIFORMYLAMINO)METHYL]-1-BENZOTHIEN-2-YL}BORONIC ACID
TypeSmall organic molecule
Emp. Form.C11H10BNO4S
Mol. Mass.263.077
SMILESOB(O)c1cc2cc(CN(C=O)C=O)ccc2s1