Reaction Details
TargetBeta-lactamase TEM
LigandBDBM50225379
Substrate/Competitorn/a
Meas. Tech.ChEMBL_451362 (CHEMBL901565)
Ki 37±n/a nM
Citation Venturelli, ATondi, DCancian, LMorandi, FCannazza, GSegatore, BPrati, FAmicosante, GShoichet, BKCosti, MP Optimizing cell permeation of an antibiotic resistance inhibitor for improved efficacy. J Med Chem50:5644-54 (2007) 
 
Beta-lactamase TEM
Name:Beta-lactamase TEM
Type:Enzyme
Mol. Mass.:31512.33
Organism:Escherichia coli
Description:P62593
Residue:286
BDBM50225379
NameBDBM50225379
Synonyms:CHEMBL235292 | pinacol 5-[(3-nitrophenylamino)methyl]benzo[b]thiophen-2-ylboronate
TypeSmall organic molecule
Emp. Form.C15H13BN2O4S
Mol. Mass.328.151
SMILESOB(O)c1cc2cc(CNc3cccc(c3)[N+]([O-])=O)ccc2s1