Reaction Details
TargetBeta-lactamase TEM
LigandBDBM50225387
Substrate/Competitorn/a
Meas. Tech.ChEMBL_451362 (CHEMBL901565)
Ki 250±n/a nM
Citation Venturelli, ATondi, DCancian, LMorandi, FCannazza, GSegatore, BPrati, FAmicosante, GShoichet, BKCosti, MP Optimizing cell permeation of an antibiotic resistance inhibitor for improved efficacy. J Med Chem50:5644-54 (2007) 
 
Beta-lactamase TEM
Name:Beta-lactamase TEM
Type:Enzyme
Mol. Mass.:31512.33
Organism:Escherichia coli
Description:P62593
Residue:286
BDBM50225387
NameBDBM50225387
Synonyms:CHEMBL396889 | pinacol 5-[(3,4-dimethoxyphenylamino)methyl]benzo[b]thiophen-2-ylboronate
TypeSmall organic molecule
Emp. Form.C17H18BNO4S
Mol. Mass.343.205
SMILESCOc1ccc(NCc2ccc3sc(cc3c2)B(O)O)cc1OC