Reaction Details
TargetFarnesyl pyrophosphate synthase
LigandBDBM25303
Substrate/Competitorn/a
Meas. Tech.ChEMBL_451566 (CHEMBL901776)
IC50 530±n/a nM
Citation Zhang, YHudock, MPKrysiak, KCao, RBergan, KYin, FLeon, AOldfield, E Activity of sulfonium bisphosphonates on tumor cell lines. J Med Chem50:6067-79 (2007) 
 
Farnesyl pyrophosphate synthase
Name:Farnesyl pyrophosphate synthase
Type:Enzyme
Mol. Mass.:48272.89
Organism:Homo sapiens (Human)
Description:P14324
Residue:419
BDBM25303
NameBDBM25303
Synonyms:CHEMBL235059 hydrogen {2-[methyl(propyl)sulfanylium]-1-phosphonoethyl}phosphonate
TypeSmall organic molecule
Emp. Form.C6H16O6P2S
Mol. Mass.278.2
SMILESCCC[S+](C)CC(P(O)(O)=O)P(O)([O-])=O