Reaction Details
TargetFarnesyl pyrophosphate synthase
LigandBDBM50225562
Substrate/Competitorn/a
Meas. Tech.ChEMBL_451566 (CHEMBL901776)
IC50 50119±n/a nM
Citation Zhang, YHudock, MPKrysiak, KCao, RBergan, KYin, FLeon, AOldfield, E Activity of sulfonium bisphosphonates on tumor cell lines. J Med Chem50:6067-79 (2007) 
 
Farnesyl pyrophosphate synthase
Name:Farnesyl pyrophosphate synthase
Type:Enzyme
Mol. Mass.:48272.89
Organism:Homo sapiens (Human)
Description:P14324
Residue:419
BDBM50225562
NameBDBM50225562
Synonyms:2-(methyl, hexadecylsulfonium-1-yl)ethylidene-1,1-bisphosphonic acid | CHEMBL235481
TypeSmall organic molecule
Emp. Form.C19H42O6P2S
Mol. Mass.460.546
[S+](C)CC(P(O)(O)=O)P(O)([O-])=O