Reaction Details
TargetFarnesyl pyrophosphate synthase
LigandBDBM50225571
Substrate/Competitorn/a
Meas. Tech.ChEMBL_451566 (CHEMBL901776)
IC50 251±n/a nM
Citation Zhang, YHudock, MPKrysiak, KCao, RBergan, KYin, FLeon, AOldfield, E Activity of sulfonium bisphosphonates on tumor cell lines. J Med Chem50:6067-79 (2007) 
 
Farnesyl pyrophosphate synthase
Name:Farnesyl pyrophosphate synthase
Type:Enzyme
Mol. Mass.:48272.89
Organism:Homo sapiens (Human)
Description:P14324
Residue:419
BDBM50225571
NameBDBM50225571
Synonyms:2-(methyl, decylsulfonium-1-yl)ethylidene-1,1-bisphosphonic acid | CHEMBL237589
TypeSmall organic molecule
Emp. Form.C13H30O6P2S
Mol. Mass.376.386
SMILESCCCCCCCCCC[S+](C)CC(P(O)(O)=O)P(O)([O-])=O