Reaction Details
TargetFarnesyl pyrophosphate synthase
LigandBDBM50225572
Substrate/Competitorn/a
Meas. Tech.ChEMBL_451566 (CHEMBL901776)
IC50 7943±n/a nM
Citation Zhang, YHudock, MPKrysiak, KCao, RBergan, KYin, FLeon, AOldfield, E Activity of sulfonium bisphosphonates on tumor cell lines. J Med Chem50:6067-79 (2007) 
 
Farnesyl pyrophosphate synthase
Name:Farnesyl pyrophosphate synthase
Type:Enzyme
Mol. Mass.:48272.89
Organism:Homo sapiens (Human)
Description:P14324
Residue:419
BDBM50225572
NameBDBM50225572
Synonyms:2-(methyl, octadecylsulfonium-1-yl)ethylidene-1,1-bisphosphonic acid | CHEMBL398105
TypeSmall organic molecule
Emp. Form.C21H46O6P2S
Mol. Mass.488.599
[S+](C)CC(P(O)(O)=O)P(O)([O-])=O