Reaction Details
TargetC-X-C chemokine receptor type 3
LigandBDBM50225717
Substrate/Competitorn/a
Meas. Tech.ChEMBL_458685 (CHEMBL942022)
Ki 350±n/a nM
Citation Watson, RJAllen, DRBirch, HLChapman, GAHannah, DRKnight, RLMeissner, JWOwen, DAThomas, EJ Development of CXCR3 antagonists. Part 2: Identification of 2-amino(4-piperidinyl)azoles as potent CXCR3 antagonists. Bioorg Med Chem Lett17:6806-10 (2007) 
 
C-X-C chemokine receptor type 3
Name:C-X-C chemokine receptor type 3
Type:Enzyme Catalytic Domain
Mol. Mass.:40665.65
Organism:Homo sapiens (Human)
Description:n/a
Residue:368
BDBM50225717
NameBDBM50225717
Synonyms:CHEMBL249016 | N-(1-(((1R,5S)-6,6-dimethylbicyclo[3.1.1]hept-2-en-2-yl)methyl)piperidin-4-yl)benzo[d]thiazol-2-amine
TypeSmall organic molecule
Emp. Form.C22H29N3S
Mol. Mass.367.551
SMILESCC1(C)[C@@H]2C[C@H]1C(CN1CCC(CC1)Nc1nc3ccccc3s1)=CC2