Reaction Details
TargetC-X-C chemokine receptor type 3
LigandBDBM50225718
Substrate/Competitorn/a
Meas. Tech.ChEMBL_458685 (CHEMBL942022)
Ki 100±n/a nM
Citation Watson, RJAllen, DRBirch, HLChapman, GAHannah, DRKnight, RLMeissner, JWOwen, DAThomas, EJ Development of CXCR3 antagonists. Part 2: Identification of 2-amino(4-piperidinyl)azoles as potent CXCR3 antagonists. Bioorg Med Chem Lett17:6806-10 (2007) 
 
C-X-C chemokine receptor type 3
Name:C-X-C chemokine receptor type 3
Type:Enzyme Catalytic Domain
Mol. Mass.:40665.65
Organism:Homo sapiens (Human)
Description:n/a
Residue:368
BDBM50225718
NameBDBM50225718
Synonyms:1-(1-(((1R,5S)-6,6-dimethylbicyclo[3.1.1]hept-2-en-2-yl)methyl)piperidin-4-yl)-3-(3-fluoro-5-(trifluoromethyl)phenyl)imidazolidine-2,4-dione | CHEMBL249178
TypeSmall organic molecule
Emp. Form.C25H29F4N3O2
Mol. Mass.479.5103
SMILESCC1(C)[C@@H]2C[C@H]1C(CN1CCC(CC1)n1cc(O)n(-c3cc(F)cc(c3)C(F)(F)F)c1=O)=CC2