Reaction Details
TargetC-X-C chemokine receptor type 3
LigandBDBM50225719
Substrate/Competitorn/a
Meas. Tech.ChEMBL_458685 (CHEMBL942022)
Ki 750±n/a nM
Citation Watson, RJAllen, DRBirch, HLChapman, GAHannah, DRKnight, RLMeissner, JWOwen, DAThomas, EJ Development of CXCR3 antagonists. Part 2: Identification of 2-amino(4-piperidinyl)azoles as potent CXCR3 antagonists. Bioorg Med Chem Lett17:6806-10 (2007) 
 
C-X-C chemokine receptor type 3
Name:C-X-C chemokine receptor type 3
Type:Enzyme Catalytic Domain
Mol. Mass.:40665.65
Organism:Homo sapiens (Human)
Description:n/a
Residue:368
BDBM50225719
NameBDBM50225719
Synonyms:1-(1-(((1R,5S)-6,6-dimethylbicyclo[3.1.1]hept-2-en-2-yl)methyl)piperidin-4-yl)-3-(3-(methylthio)phenyl)imidazolidine-2,4-dione | CHEMBL400337
TypeSmall organic molecule
Emp. Form.C25H33N3O2S
Mol. Mass.439.613
SMILESCSc1cccc(c1)-n1c(O)cn(C2CCN(CC3=CC[C@H]4C[C@@H]3C4(C)C)CC2)c1=O