Reaction Details
TargetC-X-C chemokine receptor type 3
LigandBDBM50225722
Substrate/Competitorn/a
Meas. Tech.ChEMBL_458685 (CHEMBL942022)
Ki 290±n/a nM
Citation Watson, RJAllen, DRBirch, HLChapman, GAHannah, DRKnight, RLMeissner, JWOwen, DAThomas, EJ Development of CXCR3 antagonists. Part 2: Identification of 2-amino(4-piperidinyl)azoles as potent CXCR3 antagonists. Bioorg Med Chem Lett17:6806-10 (2007) 
 
C-X-C chemokine receptor type 3
Name:C-X-C chemokine receptor type 3
Type:Enzyme Catalytic Domain
Mol. Mass.:40665.65
Organism:Homo sapiens (Human)
Description:n/a
Residue:368
BDBM50225722
NameBDBM50225722
Synonyms:5-chloro-N-(1-(((1R,5S)-6,6-dimethylbicyclo[3.1.1]hept-2-en-2-yl)methyl)piperidin-4-yl)-N-methylbenzo[d]thiazol-2-amine | CHEMBL248634
TypeSmall organic molecule
Emp. Form.C23H30ClN3S
Mol. Mass.416.022
SMILESCN(C1CCN(CC2=CC[C@H]3C[C@@H]2C3(C)C)CC1)c1nc2cc(Cl)ccc2s1