Reaction Details
TargetFarnesyl pyrophosphate synthase
LigandBDBM50225999
Substrate/Competitorn/a
Meas. Tech.ChEMBL_451825 (CHEMBL902037)
IC50 16.4±n/a nM
Citation Marma, MSXia, ZStewart, CCoxon, FDunford, JEBaron, RKashemirov, BAEbetino, FHTriffitt, JTRussell, RGMcKenna, CE Synthesis and biological evaluation of alpha-halogenated bisphosphonate and phosphonocarboxylate analogues of risedronate. J Med Chem50:5967-75 (2007) 
 
Farnesyl pyrophosphate synthase
Name:Farnesyl pyrophosphate synthase
Type:Enzyme
Mol. Mass.:48272.89
Organism:Homo sapiens (Human)
Description:P14324
Residue:419
BDBM50225999
NameBDBM50225999
Synonyms:1-fluoro-2-(3-pyridinyl)-ethylidene-1,1-bisphosphonic acid | CHEMBL437758
TypeSmall organic molecule
Emp. Form.C7H10FNO6P2
Mol. Mass.285.1033
SMILESOP(O)(=O)C(F)(Cc1cccnc1)P(O)(O)=O