Reaction Details
TargetFarnesyl pyrophosphate synthase
LigandBDBM50226002
Substrate/Competitorn/a
Meas. Tech.ChEMBL_451825 (CHEMBL902037)
IC50 253500±n/a nM
Citation Marma, MSXia, ZStewart, CCoxon, FDunford, JEBaron, RKashemirov, BAEbetino, FHTriffitt, JTRussell, RGMcKenna, CE Synthesis and biological evaluation of alpha-halogenated bisphosphonate and phosphonocarboxylate analogues of risedronate. J Med Chem50:5967-75 (2007) 
 
Farnesyl pyrophosphate synthase
Name:Farnesyl pyrophosphate synthase
Type:Enzyme
Mol. Mass.:48272.89
Organism:Homo sapiens (Human)
Description:P14324
Residue:419
BDBM50226002
NameBDBM50226002
Synonyms:(R)-2-hydroxy-2-phosphono-3-(pyridin-3-yl)propanoic acid 3-(3-Pyridyl)-2-hydroxy-2-phosphonopropanoic acid | CHEMBL397829
TypeSmall organic molecule
Emp. Form.C8H10NO6P
Mol. Mass.247.1419
SMILESOC(=O)C(O)(Cc1cccnc1)P(O)(O)=O