Reaction Details
TargetD(3) dopamine receptor
LigandBDBM50226007
Substrate/Competitorn/a
Meas. Tech.ChEMBL_458713 (CHEMBL942048)
EC50 35±n/a nM
Citation Blagg, JAllerton, CMBatchelor, DVBaxter, ADBurring, DJCarr, CLCook, ASNichols, CLPhipps, JSanderson, VGVerrier, HWong, S Design and synthesis of a functionally selective D3 agonist and its in vivo delivery via the intranasal route. Bioorg Med Chem Lett17:6691-6 (2007) 
 
D(3) dopamine receptor
Name:D(3) dopamine receptor
Type:n/a
Mol. Mass.:44243.43
Organism:Homo sapiens (Human)
Description:n/a
Residue:400
BDBM50226007
NameBDBM50226007
Synonyms:2-fluoro-5-(4-propylmorpholin-2-yl)phenol | CHEMBL401157
TypeSmall organic molecule
Emp. Form.C13H18FNO2
Mol. Mass.239.2859
SMILESCCCN1CCOC(C1)c1ccc(F)c(O)c1