Reaction Details
TargetD(1A) dopamine receptor
LigandBDBM50226008
Substrate/Competitorn/a
Meas. Tech.ChEMBL_458722 (CHEMBL942057)
IC50>10000±n/a nM
Citation Blagg, JAllerton, CMBatchelor, DVBaxter, ADBurring, DJCarr, CLCook, ASNichols, CLPhipps, JSanderson, VGVerrier, HWong, S Design and synthesis of a functionally selective D3 agonist and its in vivo delivery via the intranasal route. Bioorg Med Chem Lett17:6691-6 (2007) 
 
D(1A) dopamine receptor
Name:D(1A) dopamine receptor
Type:Enzyme
Mol. Mass.:49303.43
Organism:Homo sapiens (Human)
Description:P21728
Residue:446
BDBM50226008
NameBDBM50226008
Synonyms:(R)-3-(4-propylmorpholin-2-yl)phenol | CHEMBL250403
TypeSmall organic molecule
Emp. Form.C13H19NO2
Mol. Mass.221.2955
SMILESCCCN1CCO[C@@H](C1)c1cccc(O)c1