Reaction Details
TargetD(3) dopamine receptor
LigandBDBM50226015
Substrate/Competitorn/a
Meas. Tech.ChEMBL_458713 (CHEMBL942048)
EC50>1000±n/a nM
Citation Blagg, JAllerton, CMBatchelor, DVBaxter, ADBurring, DJCarr, CLCook, ASNichols, CLPhipps, JSanderson, VGVerrier, HWong, S Design and synthesis of a functionally selective D3 agonist and its in vivo delivery via the intranasal route. Bioorg Med Chem Lett17:6691-6 (2007) 
 
D(3) dopamine receptor
Name:D(3) dopamine receptor
Type:n/a
Mol. Mass.:44243.43
Organism:Homo sapiens (Human)
Description:n/a
Residue:400
BDBM50226015
NameBDBM50226015
Synonyms:1-(2-hydroxy-5-(4-propylmorpholin-2-yl)phenyl)ethanone | CHEMBL249588
TypeSmall organic molecule
Emp. Form.C15H21NO3
Mol. Mass.263.3321
SMILESCCCN1CCOC(C1)c1ccc(O)c(c1)C(C)=O