Reaction Details
TargetDipeptidyl peptidase 4
LigandBDBM50226067
Substrate/Competitorn/a
Meas. Tech.ChEMBL_458753 (CHEMBL943037)
IC50 3.3±n/a nM
Citation Corbett, JWDirico, KSong, WBoscoe, BPDoran, SDBoyer, DQiu, XAmmirati, MVanvolkenburg, MAMcPherson, RKParker, JCCox, ED Design and synthesis of potent amido- and benzyl-substituted cis-3-amino-4-(2-cyanopyrrolidide)pyrrolidinyl DPP-IV inhibitors. Bioorg Med Chem Lett17:6707-13 (2007) 
 
Dipeptidyl peptidase 4
Name:Dipeptidyl peptidase 4
Type:Enzyme
Mol. Mass.:88271.01
Organism:Homo sapiens (Human)
Description:P27487
Residue:766
BDBM50226067
NameBDBM50226067
Synonyms:(S)-1-((3R,4R)-1-(4-(1-methyl-1H-pyrazol-5-yl)benzyl)-3-aminopyrrolidine-4-carbonyl)pyrrolidine-2-carbonitrile | CHEMBL248793
TypeSmall organic molecule
Emp. Form.C21H26N6O
Mol. Mass.378.4707
SMILESCn1nccc1-c1ccc(CN2C[C@H](N)[C@@H](C2)C(=O)N2CCC[C@H]2C#N)cc1