Reaction Details
TargetDipeptidyl peptidase 4
LigandBDBM50226084
Substrate/Competitorn/a
Meas. Tech.ChEMBL_458753 (CHEMBL943037)
IC50 3.6±n/a nM
Citation Corbett, JWDirico, KSong, WBoscoe, BPDoran, SDBoyer, DQiu, XAmmirati, MVanvolkenburg, MAMcPherson, RKParker, JCCox, ED Design and synthesis of potent amido- and benzyl-substituted cis-3-amino-4-(2-cyanopyrrolidide)pyrrolidinyl DPP-IV inhibitors. Bioorg Med Chem Lett17:6707-13 (2007) 
 
Dipeptidyl peptidase 4
Name:Dipeptidyl peptidase 4
Type:Enzyme
Mol. Mass.:88271.01
Organism:Homo sapiens (Human)
Description:P27487
Residue:766
BDBM50226084
NameBDBM50226084
Synonyms:(S)-1-((3R,4R)-1-(3-cyano-4-fluorobenzyl)-3-aminopyrrolidine-4-carbonyl)pyrrolidine-2-carbonitrile | CHEMBL438520
TypeSmall organic molecule
Emp. Form.C18H20FN5O
Mol. Mass.341.3827
SMILESN[C@H]1CN(Cc2ccc(F)c(c2)C#N)C[C@H]1C(=O)N1CCC[C@H]1C#N