Reaction Details
TargetDipeptidyl peptidase 4
LigandBDBM50226092
Substrate/Competitorn/a
Meas. Tech.ChEMBL_458753 (CHEMBL943037)
IC50 5.3±n/a nM
Citation Corbett, JWDirico, KSong, WBoscoe, BPDoran, SDBoyer, DQiu, XAmmirati, MVanvolkenburg, MAMcPherson, RKParker, JCCox, ED Design and synthesis of potent amido- and benzyl-substituted cis-3-amino-4-(2-cyanopyrrolidide)pyrrolidinyl DPP-IV inhibitors. Bioorg Med Chem Lett17:6707-13 (2007) 
 
Dipeptidyl peptidase 4
Name:Dipeptidyl peptidase 4
Type:Enzyme
Mol. Mass.:88271.01
Organism:Homo sapiens (Human)
Description:P27487
Residue:766
BDBM50226092
NameBDBM50226092
Synonyms:(1R,3S)-2-((3R,4R)-1-(4-(5-methyl-1,3,4-oxadiazol-2-yl)benzyl)-3-aminopyrrolidine-4-carbonyl)-3-fluorocyclopentanecarbonitrile | CHEMBL249602
TypeSmall organic molecule
Emp. Form.C21H24FN5O2
Mol. Mass.397.446
SMILESCc1nnc(o1)-c1ccc(CN2C[C@H](N)[C@@H](C2)C(=O)C2[C@@H](F)CC[C@H]2C#N)cc1