Reaction Details
TargetHistone deacetylase 1
LigandBDBM50226112
Substrate/Competitorn/a
Meas. Tech.ChEMBL_451853 (CHEMBL902067)
IC50 100±n/a nM
Citation Vaisburg, APaquin, IBernstein, NFrechette, SGaudette, FLeit, SMoradei, ORaeppel, SZhou, NBouchain, GWoo, SHJin, ZGillespie, JWang, JFournel, MYan, PTTrachy-Bourget, MCRobert, MFLu, AYuk, JRahil, JMacleod, ARBesterman, JMLi, ZDelorme, D N-(2-Amino-phenyl)-4-(heteroarylmethyl)-benzamides as new histone deacetylase inhibitors. Bioorg Med Chem Lett17:6729-33 (2007) 
 
Histone deacetylase 1
Name:Histone deacetylase 1
Type:Enzyme
Mol. Mass.:55090.27
Organism:Homo sapiens (Human)
Description:Q13547
Residue:482
BDBM50226112
NameBDBM50226112
Synonyms:CHEMBL400419 | N-(2-aminophenyl)-4-((2,4-dioxo-2H-benzo[e][1,3]oxazin-3(4H)-yl)methyl)benzamide
TypeSmall organic molecule
Emp. Form.C22H17N3O4
Mol. Mass.387.3881
SMILESNc1ccccc1NC(=O)c1ccc(Cn2c(=O)oc3ccccc3c2=O)cc1