Reaction Details
TargetBeta-secretase 1
LigandBDBM50226441
Substrate/Competitorn/a
Meas. Tech.ChEMBL_451977 (CHEMBL901135)
IC50 36000±n/a nM
Citation Edwards, PDAlbert, JSSylvester, MAharony, DAndisik, DCallaghan, OCampbell, JBCarr, RAChessari, GCongreve, MFrederickson, MFolmer, RHGeschwindner, SKoether, GKolmodin, KKrumrine, JMauger, RCMurray, CWOlsson, LLPatel, SSpear, NTian, G Application of fragment-based lead generation to the discovery of novel, cyclic amidine beta-secretase inhibitors with nanomolar potency, cellular activity, and high ligand efficiency. J Med Chem50:5912-25 (2007) 
 
Beta-secretase 1
Name:Beta-secretase 1
Type:Protein
Mol. Mass.:55755.10
Organism:Homo sapiens (Human)
Description:P56817
Residue:501
BDBM50226441
NameBDBM50226441
Synonyms:2-amino-3-methyl-6-(2-(naphthalen-2-yl)ethyl)pyrimidin-4(3H)-one | CHEMBL237889
TypeSmall organic molecule
Emp. Form.C17H17N3O
Mol. Mass.279.3364
SMILESCn1c(N)nc(CCc2ccc3ccccc3c2)cc1=O