Reaction Details
TargetBeta-secretase 1
LigandBDBM50226454
Substrate/Competitorn/a
Meas. Tech.ChEMBL_451977 (CHEMBL901135)
IC50 200±n/a nM
Citation Edwards, PDAlbert, JSSylvester, MAharony, DAndisik, DCallaghan, OCampbell, JBCarr, RAChessari, GCongreve, MFrederickson, MFolmer, RHGeschwindner, SKoether, GKolmodin, KKrumrine, JMauger, RCMurray, CWOlsson, LLPatel, SSpear, NTian, G Application of fragment-based lead generation to the discovery of novel, cyclic amidine beta-secretase inhibitors with nanomolar potency, cellular activity, and high ligand efficiency. J Med Chem50:5912-25 (2007) 
 
Beta-secretase 1
Name:Beta-secretase 1
Type:Protein
Mol. Mass.:55755.10
Organism:Homo sapiens (Human)
Description:P56817
Residue:501
BDBM50226454
NameBDBM50226454
Synonyms:2-amino-6-[2-(3'-methoxybiphenyl-3-yl)ethyl]-3,6-dimethyl-5,6-dihydro-3H-pyrimidin-4-one | CHEMBL393911
TypeSmall organic molecule
Emp. Form.C21H25N3O2
Mol. Mass.351.4421
SMILESCOc1cccc(c1)-c1cccc(CCC2(C)CC(=O)N(C)C(N)=N2)c1