Reaction Details
TargetAmine oxidase [flavin-containing] A
LigandBDBM50226479
Substrate/Competitorn/a
Meas. Tech.ChEMBL_451989 (CHEMBL901149)
Ki 63000±n/a nM
Citation Poel, TJThomas, RCAdams, WJAristoff, PABarbachyn, MRBoyer, FEBrieland, JBrideau, RBrodfuehrer, JBrown, APChoy, ALDermyer, MDority, MFord, CWGadwood, RCHanna, DHongliang, CHuband, MDHuber, CKelly, RKim, JYMartin, JPPagano, PJRoss, DSkerlos, LSulavik, MCZhu, TZurenko, GEPrasad, JV Antibacterial oxazolidinones possessing a novel C-5 side chain. (5R)-trans-3-[3-Fluoro-4- (1-oxotetrahydrothiopyran-4-yl)phenyl]-2- oxooxazolidine-5-carboxylic acid amide (PF-00422602), a new lead compound. J Med Chem50:5886-9 (2007) 
 
Amine oxidase [flavin-containing] A
Name:Amine oxidase [flavin-containing] A
Type:Protein
Mol. Mass.:59689.53
Organism:Homo sapiens (Human)
Description:P21397
Residue:527
BDBM50226479
NameBDBM50226479
Synonyms:(R)-3-(3,5-difluoro-4-morpholinophenyl)-2-oxooxazolidine-5-carboxamide | CHEMBL235156
TypeSmall organic molecule
Emp. Form.C14H15F2N3O4
Mol. Mass.327.2834
SMILESNC(=O)[C@H]1CN(C(=O)O1)c1cc(F)c(N2CCOCC2)c(F)c1