Reaction Details
TargetCarboxypeptidase B2
LigandBDBM50226599
Substrate/Competitorn/a
Meas. Tech.ChEMBL_452077 (CHEMBL901238)
Ki 250±n/a nM
Citation Bunnage, MEBlagg, JSteele, JOwen, DRAllerton, CMcElroy, ABMiller, DRinger, TButcher, KBeaumont, KEvans, KGray, AJHolland, SJFeeder, NMoore, RSBrown, DG Discovery of potent& selective inhibitors of activated thrombin-activatable fibrinolysis inhibitor for the treatment of thrombosis. J Med Chem50:6095-103 (2007) 
 
Carboxypeptidase B2
Name:Carboxypeptidase B2
Type:Enzyme
Mol. Mass.:48432.74
Organism:Homo sapiens (Human)
Description:Q96IY4
Residue:423
BDBM50226599
NameBDBM50226599
Synonyms:(S)-2-(2-aminoethylamino)-3-(1-ethyl-1H-imidazol-4-yl)propanoic acid | CHEMBL235277
TypeSmall organic molecule
Emp. Form.C10H18N4O2
Mol. Mass.226.2755
SMILESCCn1cnc(C[C@H](NCCN)C(O)=O)c1