Reaction Details
TargetNAD(P)H dehydrogenase [quinone] 1
LigandBDBM50055714
Substrate/Competitorn/a
Meas. Tech.ChEMBL_452277 (CHEMBL901432)
IC50 5±n/a nM
Citation Nolan, KAZhao, HFaulder, PFFrenkel, ADTimson, DJSiegel, DRoss, DBurke, TRStratford, IJBryce, RA Coumarin-based inhibitors of human NAD(P)H:quinone oxidoreductase-1. Identification, structure-activity, off-target effects and in vitro human pancreatic cancer toxicity. J Med Chem50:6316-25 (2007) 
 
NAD(P)H dehydrogenase [quinone] 1
Name:NAD(P)H dehydrogenase [quinone] 1
Type:Homodimer
Mol. Mass.:30874.82
Organism:Homo sapiens (Human)
Description:n/a
Residue:274
BDBM50055714
NameBDBM50055714
Synonyms:3-(4,7-dihydroxy-2-oxo-2H-3-chromenylmethyl)-4,7-dihydroxy-2H-2-chromenone CHEMBL312727
TypeSmall organic molecule
Emp. Form.C19H12O8
Mol. Mass.368.2938
SMILESOc1ccc2c(O)c(Cc3c(O)c4ccc(O)cc4oc3=O)c(=O)oc2c1