Reaction Details
TargetNAD(P)H dehydrogenase [quinone] 1
LigandBDBM50055704
Substrate/Competitorn/a
Meas. Tech.ChEMBL_452277 (CHEMBL901432)
IC50 4200±n/a nM
Citation Nolan, KAZhao, HFaulder, PFFrenkel, ADTimson, DJSiegel, DRoss, DBurke, TRStratford, IJBryce, RA Coumarin-based inhibitors of human NAD(P)H:quinone oxidoreductase-1. Identification, structure-activity, off-target effects and in vitro human pancreatic cancer toxicity. J Med Chem50:6316-25 (2007) 
 
NAD(P)H dehydrogenase [quinone] 1
Name:NAD(P)H dehydrogenase [quinone] 1
Type:Homodimer
Mol. Mass.:30874.82
Organism:Homo sapiens (Human)
Description:n/a
Residue:274
BDBM50055704
NameBDBM50055704
Synonyms:4-hydroxy-3-[4-hydroxy-2-oxo-2H-3-chromenyl(phenyl)methyl]-2H-2-chromenone CHEMBL313509
TypeSmall organic molecule
Emp. Form.C25H16O6
Mol. Mass.412.3909
SMILESOc1c(C(c2ccccc2)c2c(O)c3ccccc3oc2=O)c(=O)oc2ccccc12