Reaction Details
TargetNAD(P)H dehydrogenase [quinone] 1
LigandBDBM50226820
Substrate/Competitorn/a
Meas. Tech.ChEMBL_452277 (CHEMBL901432)
IC50 150±n/a nM
Citation Nolan, KAZhao, HFaulder, PFFrenkel, ADTimson, DJSiegel, DRoss, DBurke, TRStratford, IJBryce, RA Coumarin-based inhibitors of human NAD(P)H:quinone oxidoreductase-1. Identification, structure-activity, off-target effects and in vitro human pancreatic cancer toxicity. J Med Chem50:6316-25 (2007) 
 
NAD(P)H dehydrogenase [quinone] 1
Name:NAD(P)H dehydrogenase [quinone] 1
Type:Homodimer
Mol. Mass.:30874.82
Organism:Homo sapiens (Human)
Description:n/a
Residue:274
BDBM50226820
NameBDBM50226820
Synonyms:3-((9H-fluoren-3-yl)(4-hydroxy-2-oxo-2H-chromen-3-yl)methyl)-4-hydroxy-2H-chromen-2-one | CHEMBL237186
TypeSmall organic molecule
Emp. Form.C32H20O6
Mol. Mass.500.4976
SMILESOc1c(C(c2ccc3Cc4ccccc4-c3c2)c2c(O)c3ccccc3oc2=O)c(=O)oc2ccccc12