Reaction Details
TargetC-X-C chemokine receptor type 1
LigandBDBM50227009
Substrate/Competitorn/a
Meas. Tech.ChEMBL_461467 (CHEMBL927477)
Ki 375±n/a nM
Citation Biju, PTaveras, AYu, YZheng, JChao, JRindgen, DJakway, JHipkin, RWFossetta, JFan, XFine, JQiu, HMerritt, JRBaldwin, JJ 3,4-Diamino-2,5-thiadiazole-1-oxides as potent CXCR2/CXCR1 antagonists. Bioorg Med Chem Lett18:228-31 (2008) 
 
C-X-C chemokine receptor type 1
Name:C-X-C chemokine receptor type 1
Type:Enzyme
Mol. Mass.:39803.83
Organism:Homo sapiens (Human)
Description:P25024
Residue:350
BDBM50227009
NameBDBM50227009
Synonyms:3-(4-{[(R)-furan-2-yl-(1-methyl-cyclopropyl)-methyl]-amino}-1-oxo-1H-1lambda4-[1,2,5]thiadiazol-3-ylamino)-2-hydroxy-N,N-dimethyl-benzamide | CHEMBL252911
TypeSmall organic molecule
Emp. Form.C20H23N5O4S
Mol. Mass.429.493
SMILESCN(C)C(=O)c1cccc(Nc2ns(=O)nc2N[C@@H](c2ccco2)C2(C)CC2)c1O