Reaction Details
TargetC-X-C chemokine receptor type 1
LigandBDBM50227007
Substrate/Competitorn/a
Meas. Tech.ChEMBL_461467 (CHEMBL927477)
Ki 484±n/a nM
Citation Biju, PTaveras, AYu, YZheng, JChao, JRindgen, DJakway, JHipkin, RWFossetta, JFan, XFine, JQiu, HMerritt, JRBaldwin, JJ 3,4-Diamino-2,5-thiadiazole-1-oxides as potent CXCR2/CXCR1 antagonists. Bioorg Med Chem Lett18:228-31 (2008) 
 
C-X-C chemokine receptor type 1
Name:C-X-C chemokine receptor type 1
Type:Enzyme
Mol. Mass.:39803.83
Organism:Homo sapiens (Human)
Description:P25024
Residue:350
BDBM50227007
NameBDBM50227007
Synonyms:2-hydroxy-N,N-dimethyl-3-[1-oxo-4-((S)-1,2,2-trimethyl-propylamino)-1H-1lambda4-[1,2,5]thiadiazol-3-ylamino]-benzamide | CHEMBL403936
TypeSmall organic molecule
Emp. Form.C17H25N5O3S
Mol. Mass.379.477
SMILESC[C@H](Nc1ns(=O)nc1Nc1cccc(C(=O)N(C)C)c1O)C(C)(C)C