Reaction Details
TargetC-X-C chemokine receptor type 1
LigandBDBM50227012
Substrate/Competitorn/a
Meas. Tech.ChEMBL_461467 (CHEMBL927477)
Ki 5950±n/a nM
Citation Biju, PTaveras, AYu, YZheng, JChao, JRindgen, DJakway, JHipkin, RWFossetta, JFan, XFine, JQiu, HMerritt, JRBaldwin, JJ 3,4-Diamino-2,5-thiadiazole-1-oxides as potent CXCR2/CXCR1 antagonists. Bioorg Med Chem Lett18:228-31 (2008) 
 
C-X-C chemokine receptor type 1
Name:C-X-C chemokine receptor type 1
Type:Enzyme
Mol. Mass.:39803.83
Organism:Homo sapiens (Human)
Description:P25024
Residue:350
BDBM50227012
NameBDBM50227012
Synonyms:2-hydroxy-N,N-dimethyl-3-{4-[(R)-1-(5-methyl-furan-2-yl)-propylamino]-1,1-dioxo-1H-1lambda6-[1,2,5]thiadiazol-3-ylamino}-benzamide | CHEMBL253496
TypeSmall organic molecule
Emp. Form.C19H23N5O5S
Mol. Mass.433.481
SMILESCC[C@@H](NC1=NS(=O)(=O)NC1=Nc1cccc(C(=O)N(C)C)c1O)c1ccc(C)o1