Reaction Details
TargetC-X-C chemokine receptor type 1
LigandBDBM50227010
Substrate/Competitorn/a
Meas. Tech.ChEMBL_461467 (CHEMBL927477)
Ki 4010±n/a nM
Citation Biju, PTaveras, AYu, YZheng, JChao, JRindgen, DJakway, JHipkin, RWFossetta, JFan, XFine, JQiu, HMerritt, JRBaldwin, JJ 3,4-Diamino-2,5-thiadiazole-1-oxides as potent CXCR2/CXCR1 antagonists. Bioorg Med Chem Lett18:228-31 (2008) 
 
C-X-C chemokine receptor type 1
Name:C-X-C chemokine receptor type 1
Type:Enzyme
Mol. Mass.:39803.83
Organism:Homo sapiens (Human)
Description:P25024
Residue:350
BDBM50227010
NameBDBM50227010
Synonyms:3-{4-[(R)-1-(3-fluoro-phenyl)-2-methyl-propylamino]-1-oxo-1H-1lambda4-[1,2,5]thiadiazol-3-ylamino}-2-hydroxy-N,N-dimethyl-benzamide | CHEMBL402144
TypeSmall organic molecule
Emp. Form.C21H24FN5O3S
Mol. Mass.445.51
SMILESCC(C)[C@@H](Nc1ns(=O)nc1Nc1cccc(C(=O)N(C)C)c1O)c1cccc(F)c1