Reaction Details
TargetC-X-C chemokine receptor type 2
LigandBDBM50226993
Substrate/Competitorn/a
Meas. Tech.ChEMBL_461466 (CHEMBL927478)
Ki 9±n/a nM
Citation Biju, PTaveras, AYu, YZheng, JChao, JRindgen, DJakway, JHipkin, RWFossetta, JFan, XFine, JQiu, HMerritt, JRBaldwin, JJ 3,4-Diamino-2,5-thiadiazole-1-oxides as potent CXCR2/CXCR1 antagonists. Bioorg Med Chem Lett18:228-31 (2008) 
 
C-X-C chemokine receptor type 2
Name:C-X-C chemokine receptor type 2
Type:Protein
Mol. Mass.:40767.88
Organism:Homo sapiens (Human)
Description:P25025
Residue:360
BDBM50226993
NameBDBM50226993
Synonyms:2-hydroxy-3-{4-[(R)-1-(4-isopropyl-furan-2-yl)-propylamino]-1-oxo-1H-1lambda4-[1,2,5]thiadiazol-3-ylamino}-N,N-dimethyl-benzamide | CHEMBL254942
TypeSmall organic molecule
Emp. Form.C21H27N5O4S
Mol. Mass.445.535
SMILESCC[C@@H](Nc1ns(=O)nc1Nc1cccc(C(=O)N(C)C)c1O)c1cc(co1)C(C)C