Reaction Details
Target1D-myo-inositol 2-acetamido-2-deoxy-alpha-D-glucopyranoside deacetylase
LigandBDBM50227096
Substrate/Competitorn/a
Meas. Tech.ChEMBL_452329 (CHEMBL902566)
IC50 105000±n/a nM
Citation Metaferia, BBFetterolf, BJShazad-Ul-Hussan, SMoravec, MSmith, JARay, SGutierrez-Lugo, MTBewley, CA Synthesis of natural product-inspired inhibitors of Mycobacterium tuberculosis mycothiol-associated enzymes: the first inhibitors of GlcNAc-Ins deacetylase. J Med Chem50:6326-36 (2007) 
 
1D-myo-inositol 2-acetamido-2-deoxy-alpha-D-glucopyranoside deacetylase
Name:1D-myo-inositol 2-acetamido-2-deoxy-alpha-D-glucopyranoside deacetylase
Type:PROTEIN
Mol. Mass.:31733.34
Organism:Mycobacterium tuberculosis
Description:ChEMBL_627600
Residue:303
BDBM50227096
NameBDBM50227096
Synonyms:(E)-N-((2R,3R,4R,5S,6R)-2-(cyclohexylthio)-4,5-dihydroxy-6-(hydroxymethyl)-tetrahydro-2H-pyran-3-yl)-4-phenylbut-1-ene-1-sulfonamide | CHEMBL428030
TypeSmall organic molecule
Emp. Form.C22H33NO6S2
Mol. Mass.471.631
SMILESOC[C@@H]1O[C@@H](SC2CCCCC2)[C@@H](NS(=O)(=O)\C=C\CCc2ccccc2)[C@H](O)[C@H]1O