Reaction Details
TargetSomatostatin receptor type 5
LigandBDBM50227100
Substrate/Competitorn/a
Meas. Tech.ChEMBL_452331 (CHEMBL902568)
Ki 17±n/a nM
Citation Martin, REGreen, LGGuba, WKratochwil, NChrist, A Discovery of the first nonpeptidic, small-molecule, highly selective somatostatin receptor subtype 5 antagonists: a chemogenomics approach. J Med Chem50:6291-4 (2007) 
 
Somatostatin receptor type 5
Name:Somatostatin receptor type 5
Type:Enzyme
Mol. Mass.:39218.02
Organism:Homo sapiens (Human)
Description:P35346
Residue:364
BDBM50227100
NameBDBM50227100
Synonyms:2-(1-(4-chloro-3-ethoxybenzyl)piperidin-4-ylamino)benzo[d]oxazole-5-sulfonamide | CHEMBL391637
TypeSmall organic molecule
Emp. Form.C21H25ClN4O4S
Mol. Mass.464.966
SMILESCCOc1cc(CN2CCC(CC2)Nc2nc3cc(ccc3o2)S(N)(=O)=O)ccc1Cl