Reaction Details
TargetSomatostatin receptor type 5
LigandBDBM50227132
Substrate/Competitorn/a
Meas. Tech.ChEMBL_452345 (CHEMBL902582)
Ki 20±n/a nM
Citation Guba, WGreen, LGMartin, RERoche, OKratochwil, NMauser, HBissantz, CChrist, AStahl, M From astemizole to a novel hit series of small-molecule somatostatin 5 receptor antagonists via GPCR affinity profiling. J Med Chem50:6295-8 (2007) 
 
Somatostatin receptor type 5
Name:Somatostatin receptor type 5
Type:Enzyme
Mol. Mass.:39218.02
Organism:Homo sapiens (Human)
Description:P35346
Residue:364
BDBM50227132
NameBDBM50227132
Synonyms:4-tert-butyl-N-(1-((1,4-dimethoxynaphthalen-2-yl)methyl)piperidin-4-yl)benzamide | CHEMBL400021
TypeSmall organic molecule
Emp. Form.C29H36N2O3
Mol. Mass.460.6077
SMILESCOc1cc(CN2CCC(CC2)NC(=O)c2ccc(cc2)C(C)(C)C)c(OC)c2ccccc12