Reaction Details
TargetOxysterols receptor LXR-beta
LigandBDBM50227156
Substrate/Competitorn/a
Meas. Tech.ChEMBL_461472 (CHEMBL927483)
IC50 3±n/a nM
Citation Hu, BQuinet, EUnwalla, RCollini, MJetter, JDooley, RAndraka, DNogle, LSavio, DHalpern, AGoos-Nilsson, AWilhelmsson, ANambi, PWrobel, J Carboxylic acid based quinolines as liver X receptor modulators that have LXRbeta receptor binding selectivity. Bioorg Med Chem Lett18:54-9 (2008) 
 
Oxysterols receptor LXR-beta
Name:Oxysterols receptor LXR-beta
Type:Enzyme Catalytic Domain
Mol. Mass.:50978.79
Organism:Homo sapiens (Human)
Description:P55055
Residue:460
BDBM50227156
NameBDBM50227156
Synonyms:2-(4-((3-(3-benzyl-8-(trifluoromethyl)quinolin-4-yl)phenoxy)methyl)-2,5-dimethylphenyl)acetic acid | CHEMBL254945
TypeSmall organic molecule
Emp. Form.C34H28F3NO3
Mol. Mass.555.5862
SMILESCc1cc(CC(O)=O)c(C)cc1COc1cccc(c1)-c1c(Cc2ccccc2)cnc2c(cccc12)C(F)(F)F