Reaction Details
TargetOxysterols receptor LXR-beta
LigandBDBM50227151
Substrate/Competitorn/a
Meas. Tech.ChEMBL_461472 (CHEMBL927483)
IC50 5±n/a nM
Citation Hu, BQuinet, EUnwalla, RCollini, MJetter, JDooley, RAndraka, DNogle, LSavio, DHalpern, AGoos-Nilsson, AWilhelmsson, ANambi, PWrobel, J Carboxylic acid based quinolines as liver X receptor modulators that have LXRbeta receptor binding selectivity. Bioorg Med Chem Lett18:54-9 (2008) 
 
Oxysterols receptor LXR-beta
Name:Oxysterols receptor LXR-beta
Type:Enzyme Catalytic Domain
Mol. Mass.:50978.79
Organism:Homo sapiens (Human)
Description:P55055
Residue:460
BDBM50227151
NameBDBM50227151
Synonyms:2-(5-(3-(3-benzyl-8-(trifluoromethyl)quinolin-4-yl)benzylamino)naphthalen-1-yl)acetic acid | CHEMBL253311
TypeSmall organic molecule
Emp. Form.C36H27F3N2O2
Mol. Mass.576.607
SMILESOC(=O)Cc1cccc2c(NCc3cccc(c3)-c3c(Cc4ccccc4)cnc4c(cccc34)C(F)(F)F)cccc12