Reaction Details
TargetPhenylethanolamine N-methyltransferase
LigandBDBM50174121
Substrate/Competitorn/a
Meas. Tech.ChEMBL_461583 (CHEMBL927606)
Ki 17±n/a nM
Citation Grunewald, GLSeim, MRBhat, SRWilson, MECriscione, KR Synthesis of 4,5,6,7-tetrahydrothieno[3,2-c]pyridines and comparison with their isosteric 1,2,3,4-tetrahydroisoquinolines as inhibitors of phenylethanolamine N-methyltransferase. Bioorg Med Chem16:542-59 (2008) 
 
Phenylethanolamine N-methyltransferase
Name:Phenylethanolamine N-methyltransferase
Type:Enzyme
Mol. Mass.:30852.66
Organism:Homo sapiens (Human)
Description:n/a
Residue:282
BDBM50174121
NameBDBM50174121
Synonyms:7-bromo-3-methyl-1,2,3,4-tetrahydroisoquinoline CHEMBL200375
TypeSmall organic molecule
Emp. Form.C10H12BrN
Mol. Mass.226.113
SMILESCC1Cc2ccc(Br)cc2CN1