Reaction Details
TargetPhenylethanolamine N-methyltransferase
LigandBDBM50072977
Substrate/Competitorn/a
Meas. Tech.ChEMBL_461584 (CHEMBL927607)
Ki 56±n/a nM
Citation Grunewald, GLSeim, MRBhat, SRWilson, MECriscione, KR Synthesis of 4,5,6,7-tetrahydrothieno[3,2-c]pyridines and comparison with their isosteric 1,2,3,4-tetrahydroisoquinolines as inhibitors of phenylethanolamine N-methyltransferase. Bioorg Med Chem16:542-59 (2008) 
 
Phenylethanolamine N-methyltransferase
Name:Phenylethanolamine N-methyltransferase
Type:Enzyme
Mol. Mass.:30916.97
Organism:Bos taurus (bovine)
Description:n/a
Residue:283
BDBM50072977
NameBDBM50072977
Synonyms:7-Bromo-1,2,3,4-tetrahydro-isoquinoline CHEMBL281864
TypeSmall organic molecule
Emp. Form.C9H10BrN
Mol. Mass.212.086
SMILESBrc1ccc2CCNCc2c1