Reaction Details
TargetC-X-C chemokine receptor type 3
LigandBDBM50227865
Substrate/Competitorn/a
Meas. Tech.ChEMBL_461631 (CHEMBL928749)
Ki 18±n/a nM
Citation Watson, RJAllen, DRBirch, HLChapman, GAGalvin, FCJopling, LAKnight, RLMeier, DOliver, KMeissner, JWOwen, DAThomas, EJTremayne, NWilliams, SC Development of CXCR3 antagonists. Part 3: Tropenyl and homotropenyl-piperidine urea derivatives. Bioorg Med Chem Lett18:147-51 (2008) 
 
C-X-C chemokine receptor type 3
Name:C-X-C chemokine receptor type 3
Type:Enzyme Catalytic Domain
Mol. Mass.:40665.65
Organism:Homo sapiens (Human)
Description:n/a
Residue:368
BDBM50227865
NameBDBM50227865
Synonyms:1-(3-fluoro-5-(trifluoromethyl)phenyl)-3-(1-((8-pivaloyl-8-aza-bicyclo[3.2.1]oct-2-en-3-yl)methyl)piperidin-4-yl)urea | CHEMBL254537
TypeSmall organic molecule
Emp. Form.C26H34F4N4O2
Mol. Mass.510.5674
SMILESCC(C)(C)C(=O)N1C2CCC1C=C(CN1CCC(CC1)NC(=O)Nc1cc(F)cc(c1)C(F)(F)F)C2