Reaction Details
TargetC-X-C chemokine receptor type 3
LigandBDBM50227867
Substrate/Competitorn/a
Meas. Tech.ChEMBL_461631 (CHEMBL928749)
Ki 11±n/a nM
Citation Watson, RJAllen, DRBirch, HLChapman, GAGalvin, FCJopling, LAKnight, RLMeier, DOliver, KMeissner, JWOwen, DAThomas, EJTremayne, NWilliams, SC Development of CXCR3 antagonists. Part 3: Tropenyl and homotropenyl-piperidine urea derivatives. Bioorg Med Chem Lett18:147-51 (2008) 
 
C-X-C chemokine receptor type 3
Name:C-X-C chemokine receptor type 3
Type:Enzyme Catalytic Domain
Mol. Mass.:40665.65
Organism:Homo sapiens (Human)
Description:n/a
Residue:368
BDBM50227867
NameBDBM50227867
Synonyms:1-(1-((9-acetyl-9-aza-bicyclo[3.3.1]non-2-en-3-yl)methyl)piperidin-4-yl)-3-(3-isopropoxyphenyl)urea | CHEMBL253247
TypeSmall organic molecule
Emp. Form.C26H38N4O3
Mol. Mass.454.6049
SMILESCC(C)Oc1cccc(NC(=O)NC2CCN(CC3=CC4CCCC(C3)N4C(C)=O)CC2)c1